BDBM227054 US9328096, 742
SMILES CC(CO)CNC(=O)c1cc(NC(=O)c2cc(c(Cl)cc2Cl)-c2ncccc2F)n(n1)-c1ccccc1
InChI Key InChIKey=DPQVGWVJNKBBGC-UHFFFAOYSA-N
Data  1 IC50
  Tab Delimited (TSV)   2D SDfile   Computed 3D by Vconf -m prep SDfile
Find this compound or compounds like it in BindingDB:
Activity Spreadsheet -- Enzyme Inhibition Constant Data from BindingDB
Found 1 hit for monomerid = 227054
TargetHigh affinity nerve growth factor receptor [441-796](Homo sapiens (Human))
Pfizer
US Patent
LigandPNGBDBM227054(US9328096, 742)
Affinity DataIC50:  4.5nMT: 2°C. Assay description: TRKA co-expressed with p75: The assays are based upon DiscoveRx's proprietary Enzyme Fragment Complementation (EFC) technology. In the case of the TR...
Ligand InfoPC cidPC sid
In DepthDetails US Patent